Android - Error de aapt.exe

   
Vista:

Error de aapt.exe

Publicado por Federico devoto (2 intervenciones) el 23/03/2016 14:11:28
Buenos días.

Al querer ejecutar un proyecto, me aparece un error de aapt.exe, que retorna 1. A que se debe esto?. Esto me ocurre con todos los proyectos, hasta con el holaMundo que genera por defecto.


Utilizo Android Studio.

Muchas gracias.
Valora esta pregunta
Me gusta: Está pregunta es útil y esta claraNo me gusta: Está pregunta no esta clara o no es útil
0
Responder

Error de aapt.exe

Publicado por Federico devoto (2 intervenciones) el 23/03/2016 14:30:09
El error es

FAILURE: Build failed with an exception.

* What went wrong:
Execution failed for task ':app:processDebugResources'.
> com.android.ide.common.process.ProcessException: org.gradle.process.internal.ExecException: Process 'command 'C:\WINDOWS\system32\config\systemprofile\AppData\Local\Android\Sdk\build-tools\21.0.1\aapt.exe'' finished with non-zero exit value -1073741819

* Try:
Run with --stacktrace option to get the stack trace. Run with --info or --debug option to get more log output.

BUILD FAILED
Valora esta respuesta
Me gusta: Está respuesta es útil y esta claraNo me gusta: Está respuesta no esta clara o no es útil
0
Comentar